{"text_format":"1","workbook":"xlsx","n_sheets":9,"sheets":["Background","Game Introduction","Schedule Requirements","Build Your Schedule","Error Summary","Error Details","Optimization Approach","OS Statistics","checker"],"not_rendered":{"charts":0,"images":1,"macros":1,"external_links":0,"defined_names":57,"comments":0,"pivot_tables":0},"unopened":[],"bounds":{"document_bytes":16777216,"sheet_cells":100000,"rows_first":2000,"rows_last":500,"rows_between":2000,"halvings":0,"cell_chars":16384,"cell_head_chars":4096},"cells_cut":0,"cells_raw":0,"read":"whole","date_system":"1900"}

{"sheet":"Background","index":0,"n_rows":14,"n_cols":2,"rows_kept":14,"cut":false,"hidden":false,"merged":[]}
[]
[]
[]
[]
[]
[null,"Creating Schedules for Medical Residents: Manual and Optimization-Based Approaches"]
[]
[null,"Background"]
{"$rows_left_out":7}
{"sheet":"Game Introduction","index":1,"n_rows":13,"n_cols":2,"rows_kept":13,"cut":false,"hidden":false,"merged":[]}
[]
[null,"The Game"]
[null,"Your challenge is to build a feasible shift schedule for a month in the Pediatric Emergency Department. For each shift, you will need to assign one of the residents currently on rotation, while ensuring that all of the given rules (a small subset of the true set of rules) are followed."]
[]
[null,"How to Play"]
[null,"1. Read the \"Schedule Requirements\" tab and make note of the rules that you must follow to create a feasible schedule."]
[null,"2. In the \"Build Your Schedule\" tab, type the name of the resident you wish to assign to each shift. "]
[null,"3. When you've finished creating your schedule, click the \"Check For Errors\" button in the same tab to see whether or not your schedule is feasible."]
{"$rows_left_out":6}
{"sheet":"Schedule Requirements","index":2,"n_rows":14,"n_cols":2,"rows_kept":14,"cut":false,"hidden":false,"merged":[[13,1,13,3],[8,1,8,3],[9,1,9,3],[10,1,10,3],[11,1,11,3],[12,1,12,3],[1,1,1,3],[2,1,2,3],[4,1,4,3],[5,1,5,3],[6,1,6,3]]}
[]
[null,"Schedule Requirements"]
[null,"The following is a greatly-simplified version of the set of rules that the Chief Resident must satisfy when building a schedule. "]
[]
[null,"Definitions"]
[null,"Night Shifts: The (8p-5a) and (11p-8a) shifts are considered night shifts"]
[null,"Interns: First year residents are referred to as interns"]
[]
{"$rows_left_out":7}
{"sheet":"Build Your Schedule","index":3,"n_rows":39,"n_cols":37,"rows_kept":39,"cut":false,"hidden":false,"merged":[[13,2,13,3],[8,2,8,3],[9,2,9,3],[10,2,10,3],[11,2,11,3],[12,2,12,3],[3,1,3,4],[4,2,4,3],[5,2,5,3],[6,2,6,3],[7,2,7,3],[38,1,38,4],[35,1,35,4],[31,1,31,4],[36,1,36,4],[37,1,37,4],[32,1,32,4],[33,1,33,4],[34,1,34,4],[30,1,30,4],[14,2,14,3],[15,2,15,3],[16,2,16,3],[17,2,17,3],[18,2,18,3],[19,2,19,3],[20,2,20,3],[22,1,22,3],[1,7,1,16],[26,3,26,4],[27,3,27,4],[28,3,28,4],[29,3,29,4],[21,1,21,4],[23,1,23,2],[24,1,24,2],[25,1,25,2],[26,1,26,2],[27,1,27,2],[28,1,28,2],[29,1,29,2],[23,3,23,4],[24,3,24,4],[25,3,25,4]]}
[]
[null,null,null,null,null,null,null,"June Schedule (Insert resident names in the cells below)"]
[null,null,null,null,null,null,null,"Mon","Tue","Wed","Thu","Fri","Sat","Sun","Mon","Tue","Wed","Thu","Fri","Sat","Sun","Mon","Tue","Wed","Thu","Fri","Sat","Sun","Mon","Tue","Wed","Thu","Fri","Sat","Sun","Mon","Tue"]
[null,"Resident Requirements",null,null,null,null,"Day Shift","2015-06-01","2015-06-02","2015-06-03","2015-06-04","2015-06-05","2015-06-06","2015-06-07","2015-06-08","2015-06-09","2015-06-10","2015-06-11","2015-06-12","2015-06-13","2015-06-14","2015-06-15","2015-06-16","2015-06-17","2015-06-18","2015-06-19","2015-06-20","2015-06-21","2015-06-22","2015-06-23","2015-06-24","2015-06-25","2015-06-26","2015-06-27","2015-06-28","2015-06-29","2015-06-30"]
[null,"Name","Is Intern?",null,"Cannot Work on…",null,"7a-4p"]
[null,"Adamson","Yes",null,"Wednesdays",null,"9a-6p"]
[null,"Almanza",null,null,"Thursdays",null,"12p-9p"]
[null,"Chase","Yes",null,"Mondays",null,"4p-1a"]
{"$rows_left_out":32}
{"sheet":"Error Summary","index":4,"n_rows":15,"n_cols":3,"rows_kept":15,"cut":false,"hidden":true,"merged":[[14,2,15,2],[14,1,15,1]]}
[]
[null,"List of Errors","Number of Violations"]
[null,"Number of Shifts Without a Resident",{"$f":"COUNTBLANK('Build Your Schedule'!H5:AK11)","v":210}]
[null,"Number of Misspellings",{"$f":"SUM('Error Details'!C23:AF29)","v":0}]
[null,"Number of Residents…."]
[null,"…not reaching at least 12 shifts",{"$f":"COUNTIF('Error Details'!F3:G18,\">\"&0)","v":16}]
[null,"…exceeding more than 16 shifts",{"$f":"COUNTIF('Error Details'!H3:I18,\">\"&0)","v":0}]
[null,"…not reaching at least 2 night shifts",{"$f":"COUNTIF('Error Details'!L3:M18,\">\"&0)","v":16}]
{"$rows_left_out":8}
{"sheet":"Error Details","index":5,"n_rows":174,"n_cols":32,"rows_kept":174,"cut":false,"hidden":true,"merged":[[17,13,17,14],[1,1,1,2],[1,3,1,4],[1,5,1,6],[1,7,1,8],[16,11,16,12],[17,11,17,12],[2,13,2,14],[3,13,3,14],[4,13,4,14],[5,13,5,14],[6,13,6,14],[7,13,7,14],[8,13,8,14],[9,13,9,14],[10,13,10,14],[11,13,11,14],[12,13,12,14],[13,13,13,14],[14,13,14,14],[15,13,15,14],[16,9,16,10],[17,9,17,10],[10,9,10,10],[17,21,17,22],[2,11,2,12],[3,11,3,12],[4,11,4,12],[5,11,5,12],[6,11,6,12],[7,11,7,12],[8,11,8,12],[9,11,9,12],[10,11,10,12],[11,11,11,12],[12,11,12,12],[13,11,13,12],[14,11,14,12],[15,11,15,12],[16,19,16,20],[17,19,17,20],[2,21,2,22],[3,21,3,22],[4,21,4,22],[5,21,5,22],[6,21,6,22],[7,21,7,22],[16,13,16,14],[8,21,8,22],[9,21,9,22],[10,21,10,22],[11,21,11,22],[12,21,12,22],[13,21,13,22],[14,21,14,22],[15,21,15,22],[16,17,16,18],[16,21,16,22],[9,15,9,16],[17,17,17,18],[2,19,2,20],[3,19,3,20],[4,19,4,20],[5,19,5,20],[6,19,6,20],[7,19,7,20],[8,19,8,20],[9,19,9,20],[10,19,10,20],[11,19,11,20],[12,19,12,20],[13,19,13,20],[14,19,14,20],[15,19,15,20],[12,9,12,10],[13,9,13,10],[14,9,14,10],[15,9,15,10],[16,15,16,16],[17,15,17,16],[2,17,2,18],[4,17,4,18],[5,17,5,18],[6,17,6,18],[7,17,7,18],[3,17,3,18],[8,17,8,18],[9,17,9,18],[10,17,10,18],[11,17,11,18],[12,17,12,18],[13,17,13,18],[14,17,14,18],[15,17,15,18],[2,15,2,16],[3,15,3,16],[7,15,7,16],[8,15,8,16],[17,5,17,6],[2,3,2,4],[3,3,3,4],[4,3,4,4],[5,3,5,4],[6,3,6,4],[7,3,7,4],[10,15,10,16],[11,15,11,16],[12,15,12,16],[13,15,13,16],[14,15,14,16],[15,15,15,16],[16,7,16,8],[17,7,17,8],[2,9,2,10],[3,9,3,10],[4,9,4,10],[5,9,5,10],[6,9,6,10],[7,9,7,10],[8,9,8,10],[9,9,9,10],[11,9,11,10],[11,7,11,8],[12,7,12,8],[13,7,13,8],[14,7,14,8],[15,7,15,8],[16,5,16,6],[8,5,8,6],[9,5,9,6],[10,5,10,6],[30,1,30,7],[1,15,1,16],[1,17,1,18],[1,19,1,20],[8,3,8,4],[9,3,9,4],[10,3,10,4],[11,3,11,4],[12,3,12,4],[13,3,13,4],[14,3,14,4],[15,3,15,4],[11,5,11,6],[12,5,12,6],[13,5,13,6],[14,5,14,6],[15,5,15,6],[16,3,16,4],[17,3,17,4],[2,7,2,8],[7,7,7,8],[11,1,11,2],[12,1,12,2],[13,1,13,2],[17,1,17,2],[1,21,1,22],[1,13,1,14],[1,11,1,12],[1,9,1,10],[2,5,2,6],[3,5,3,6],[4,5,4,6],[5,5,5,6],[6,5,6,6],[3,7,3,8],[4,7,4,8],[5,7,5,8],[6,7,6,8],[4,15,4,16],[5,15,5,16],[6,15,6,16],[7,5,7,6],[2,1,2,2],[3,1,3,2],[4,1,4,2],[8,7,8,8],[9,7,9,8],[10,7,10,8],[5,1,5,2],[6,1,6,2],[7,1,7,2],[8,1,8,2],[9,1,9,2],[10,1,10,2],[14,1,14,2],[15,1,15,2],[16,1,16,2]]}
[]
[null,"Resident Name",null,"Number of Shifts ",null,"Number of Shifts Under the Minimum",null,"Number of Shifts Exceeding the Maximum",null,"Number of Night Shifts",null,"Number of Night Shifts Under the Minimum",null,"Number of Night Shifts Exceeding the Maximum",null,"Number of 7a-4p Shifts (Applies to Interns Only)",null,"Number of 11p-8a Shifts (Applies to Interns Only)",null,"Number of Shifts on Required Day Off",null,"Required Day Off"]
[null,{"$f":"'Build Your Schedule'!B6","v":"Adamson"},null,{"$f":"COUNTIF('Build Your Schedule'!$H$5:$AK$11,B3)","v":0},null,{"$f":"IF($D3<12,12-D3,0)","v":12},null,{"$f":"IF($D3>16,D3-16,0)","v":0},null,{"$f":"COUNTIF('Build Your Schedule'!$H$10:$AK$11,'Error Details'!B3)","v":0},null,{"$f":"IF(J3<2,2-J3,0)","v":2},null,{"$f":"IF(J3>5,J3-5,0)","v":0},null,{"$f":"COUNTIF('Build Your Schedule'!$H$5:$AK$5,B3)","v":0},null,{"$f":"COUNTIF('Build Your Schedule'!$H$11:$AK$11,B3)","v":0},null,{"$f":"COUNTIF('Build Your Schedule'!$J$5:$J$11,B3)+COUNTIF('Build Your Schedule'!$Q$5:$Q$11,B3)+COUNTIF('Build Your Schedule'!$X$5:$X$11,B3)+COUNTIF('Build Your Schedule'!$AE$5:$AE$11,B3)","v":0},null,{"$f":"'Build Your Schedule'!E6","v":"Wednesdays"}]
[null,{"$f":"'Build Your Schedule'!B7","v":"Almanza"},null,{"$f":"COUNTIF('Build Your Schedule'!$H$5:$AK$11,B4)","v":0},null,{"$f":"IF($D4<12,12-D4,0)","v":12},null,{"$f":"IF($D4>16,D4-16,0)","v":0},null,{"$f":"COUNTIF('Build Your Schedule'!$H$10:$AK$11,'Error Details'!B4)","v":0},null,{"$f":"IF(J4<2,2-J4,0)","v":2},null,{"$f":"IF(J4>5,J4-5,0)","v":0},null,"N/A",null,"N/A",null,{"$f":"COUNTIF('Build Your Schedule'!$K$5:$K$11,B4)+COUNTIF('Build Your Schedule'!$R$5:$R$11,B4)+COUNTIF('Build Your Schedule'!$Y$5:$Y$11,B4)+COUNTIF('Build Your Schedule'!$AF$5:$AF$11,B4)","v":0},null,{"$f":"'Build Your Schedule'!E7","v":"Thursdays"}]
[null,{"$f":"'Build Your Schedule'!B8","v":"Chase"},null,{"$f":"COUNTIF('Build Your Schedule'!$H$5:$AK$11,B5)","v":0},null,{"$f":"IF($D5<12,12-D5,0)","v":12},null,{"$f":"IF($D5>16,D5-16,0)","v":0},null,{"$f":"COUNTIF('Build Your Schedule'!$H$10:$AK$11,'Error Details'!B5)","v":0},null,{"$f":"IF(J5<2,2-J5,0)","v":2},null,{"$f":"IF(J5>5,J5-5,0)","v":0},null,{"$f":"COUNTIF('Build Your Schedule'!$H$5:$AK$5,B5)","v":0},null,{"$f":"COUNTIF('Build Your Schedule'!$H$11:$AK$11,B5)","v":0},null,{"$f":"COUNTIF('Build Your Schedule'!$H$5:$H$11,B5)+COUNTIF('Build Your Schedule'!$O$5:$O$11,B5)+COUNTIF('Build Your Schedule'!$V$5:$V$11,B5)+COUNTIF('Build Your Schedule'!$AC$5:$AC$11,B5)+COUNTIF('Build Your Schedule'!$AJ$5:$AJ$11,B5)","v":0},null,{"$f":"'Build Your Schedule'!E8","v":"Mondays"}]
[null,{"$f":"'Build Your Schedule'!B9","v":"Dunn"},null,{"$f":"COUNTIF('Build Your Schedule'!$H$5:$AK$11,B6)","v":0},null,12,null,0,null,{"$f":"COUNTIF('Build Your Schedule'!$H$10:$AK$11,'Error Details'!B6)","v":0},null,2,null,0,null,{"$f":"COUNTIF('Build Your Schedule'!$H$5:$AK$5,B6)","v":0},null,{"$f":"COUNTIF('Build Your Schedule'!$H$11:$AK$11,B6)","v":0},null,{"$f":"COUNTIF('Build Your Schedule'!$J$5:$J$11,B6)+COUNTIF('Build Your Schedule'!$Q$5:$Q$11,B6)+COUNTIF('Build Your Schedule'!$X$5:$X$11,B6)+COUNTIF('Build Your Schedule'!$AE$5:$AE$11,B6)","v":0},null,{"$f":"'Build Your Schedule'!E9","v":"Wednesdays"}]
[null,{"$f":"'Build Your Schedule'!B10","v":"Elder"},null,{"$f":"COUNTIF('Build Your Schedule'!$H$5:$AK$11,B7)","v":0},null,12,null,0,null,{"$f":"COUNTIF('Build Your Schedule'!$H$10:$AK$11,'Error Details'!B7)","v":0},null,2,null,0,null,"N/A",null,"N/A",null,{"$f":"COUNTIF('Build Your Schedule'!$M$5:$M$11,B7)+COUNTIF('Build Your Schedule'!$T$5:$T$11,B7)+COUNTIF('Build Your Schedule'!$AA$5:$AA$11,B7)+COUNTIF('Build Your Schedule'!$AH$5:$AH$11,B7)","v":0},null,{"$f":"'Build Your Schedule'!E10","v":"Saturdays"}]
[null,{"$f":"'Build Your Schedule'!B11","v":"Ellington"},null,{"$f":"COUNTIF('Build Your Schedule'!$H$5:$AK$11,B8)","v":0},null,12,null,0,null,{"$f":"COUNTIF('Build Your Schedule'!$H$10:$AK$11,'Error Details'!B8)","v":0},null,2,null,0,null,"N/A",null,"N/A",null,{"$f":"COUNTIF('Build Your Schedule'!$J$5:$J$11,B8)+COUNTIF('Build Your Schedule'!$Q$5:$Q$11,B8)+COUNTIF('Build Your Schedule'!$X$5:$X$11,B8)+COUNTIF('Build Your Schedule'!$AE$5:$AE$11,B8)","v":0},null,{"$f":"'Build Your Schedule'!E11","v":"Wednesdays"}]
{"$rows_left_out":167}
{"sheet":"Optimization Approach","index":6,"n_rows":343,"n_cols":214,"rows_kept":343,"cut":false,"hidden":true,"merged":[[247,1,247,2],[15,151,15,157],[15,158,15,164],[15,165,15,171],[15,172,15,178],[15,179,15,185],[15,186,15,192],[15,116,15,122],[15,123,15,129],[15,130,15,136],[15,137,15,143],[15,144,15,150],[16,123,16,129],[16,130,16,136],[16,137,16,143],[16,144,16,150],[16,151,16,157],[16,116,16,122],[16,39,16,45],[16,46,16,52],[16,53,16,59],[16,60,16,66],[16,67,16,73],[16,74,16,80],[16,200,16,206],[16,207,16,213],[16,32,16,38],[15,11,15,17],[15,18,15,24],[15,25,15,31],[15,32,15,38],[15,39,15,45],[15,46,15,52],[15,53,15,59],[15,60,15,66],[15,67,15,73],[15,74,15,80],[15,81,15,87],[15,88,15,94],[16,158,16,164],[15,193,15,199],[15,200,15,206],[15,207,15,213],[16,193,16,199],[16,165,16,171],[16,172,16,178],[16,179,16,185],[16,186,16,192],[16,109,16,115],[15,95,15,101],[15,102,15,108],[15,109,15,115],[249,4,249,6],[249,7,249,9],[249,10,249,12],[249,13,249,15],[16,4,16,10],[15,4,15,10],[16,11,16,17],[16,18,16,24],[16,25,16,31],[307,53,307,59],[307,60,307,66],[307,67,307,73],[307,74,307,80],[307,81,307,87],[16,81,16,87],[16,88,16,94],[16,95,16,101],[16,102,16,108],[307,88,307,94],[307,95,307,101],[307,102,307,108],[268,2,268,3],[307,39,307,45],[307,46,307,52],[326,4,326,10],[326,11,326,17],[326,18,326,24],[326,25,326,31],[326,32,326,38],[326,39,326,45],[326,46,326,52],[307,4,307,10],[307,32,307,38],[307,11,307,17],[307,18,307,24],[307,25,307,31],[307,109,307,115],[307,179,307,185],[307,186,307,192],[307,193,307,199],[307,200,307,206],[307,207,307,213],[307,144,307,150],[307,151,307,157],[307,158,307,164],[307,165,307,171],[307,172,307,178],[307,116,307,122],[307,123,307,129],[307,130,307,136],[307,137,307,143],[326,88,326,94],[326,95,326,101],[326,102,326,108],[326,109,326,115],[326,116,326,122],[326,53,326,59],[326,60,326,66],[326,67,326,73],[326,74,326,80],[326,81,326,87],[326,193,326,199],[326,200,326,206],[326,207,326,213],[326,158,326,164],[326,165,326,171],[326,172,326,178],[326,179,326,185],[326,186,326,192],[326,123,326,129],[326,130,326,136],[326,137,326,143],[326,144,326,150],[326,151,326,157]]}
[]
[null,null,"Schedule"]
[null,null,"Mon","Tue","Wed","Thu","Fri","Sat","Sun","Mon","Tue","Wed","Thu","Fri","Sat","Sun","Mon","Tue","Wed","Thu","Fri","Sat","Sun","Mon","Tue","Wed","Thu","Fri","Sat","Sun","Mon","Tue"]
[null,null,"2015-06-01","2015-06-02","2015-06-03","2015-06-04","2015-06-05","2015-06-06","2015-06-07","2015-06-08","2015-06-09","2015-06-10","2015-06-11","2015-06-12","2015-06-13","2015-06-14","2015-06-15","2015-06-16","2015-06-17","2015-06-18","2015-06-19","2015-06-20","2015-06-21","2015-06-22","2015-06-23","2015-06-24","2015-06-25","2015-06-26","2015-06-27","2015-06-28","2015-06-29","2015-06-30"]
[null,"7a-4p",{"$f":"OFFSET($E36,C$12,0)","v":{"$error":"#N/A"}},{"$f":"OFFSET($E36,D$12,0)","v":{"$error":"#N/A"}},{"$f":"OFFSET($E36,E$12,0)","v":{"$error":"#N/A"}},{"$error":"#N/A"},{"$f":"OFFSET($E36,G$12,0)","v":{"$error":"#N/A"}},{"$error":"#N/A"},{"$error":"#N/A"},{"$error":"#N/A"},{"$error":"#N/A"},{"$error":"#N/A"},{"$error":"#N/A"},{"$error":"#N/A"},{"$error":"#N/A"},{"$error":"#N/A"},{"$error":"#N/A"},{"$error":"#N/A"},{"$error":"#N/A"},{"$error":"#N/A"},{"$error":"#N/A"},{"$error":"#N/A"},{"$error":"#N/A"},{"$error":"#N/A"},{"$error":"#N/A"},{"$error":"#N/A"},{"$error":"#N/A"},{"$error":"#N/A"},{"$error":"#N/A"},{"$error":"#N/A"},{"$error":"#N/A"},{"$error":"#N/A"}]
[null,"9a-6p",{"$f":"OFFSET($E37,C$12,0)","v":{"$error":"#N/A"}},{"$error":"#N/A"},{"$error":"#N/A"},{"$error":"#N/A"},{"$error":"#N/A"},{"$error":"#N/A"},{"$error":"#N/A"},{"$error":"#N/A"},{"$error":"#N/A"},{"$error":"#N/A"},{"$error":"#N/A"},{"$error":"#N/A"},{"$error":"#N/A"},{"$error":"#N/A"},{"$error":"#N/A"},{"$error":"#N/A"},{"$error":"#N/A"},{"$error":"#N/A"},{"$error":"#N/A"},{"$error":"#N/A"},{"$error":"#N/A"},{"$error":"#N/A"},{"$error":"#N/A"},{"$error":"#N/A"},{"$error":"#N/A"},{"$error":"#N/A"},{"$error":"#N/A"},{"$error":"#N/A"},{"$error":"#N/A"},{"$error":"#N/A"}]
[null,"12p-9p",{"$f":"OFFSET($E38,C$12,0)","v":{"$error":"#N/A"}},{"$f":"OFFSET($E38,D$12,0)","v":{"$error":"#N/A"}},{"$error":"#N/A"},{"$error":"#N/A"},{"$error":"#N/A"},{"$error":"#N/A"},{"$error":"#N/A"},{"$error":"#N/A"},{"$error":"#N/A"},{"$error":"#N/A"},{"$error":"#N/A"},{"$error":"#N/A"},{"$error":"#N/A"},{"$error":"#N/A"},{"$error":"#N/A"},{"$error":"#N/A"},{"$error":"#N/A"},{"$error":"#N/A"},{"$error":"#N/A"},{"$error":"#N/A"},{"$error":"#N/A"},{"$error":"#N/A"},{"$error":"#N/A"},{"$error":"#N/A"},{"$error":"#N/A"},{"$error":"#N/A"},{"$error":"#N/A"},{"$error":"#N/A"},{"$error":"#N/A"},{"$error":"#N/A"}]
[null,"4p-1a",{"$f":"OFFSET($E39,C$12,0)","v":{"$error":"#N/A"}},{"$f":"OFFSET($E39,D$12,0)","v":{"$error":"#N/A"}},{"$f":"OFFSET($E39,E$12,0)","v":{"$error":"#N/A"}},{"$error":"#N/A"},{"$error":"#N/A"},{"$error":"#N/A"},{"$error":"#N/A"},{"$error":"#N/A"},{"$error":"#N/A"},{"$error":"#N/A"},{"$error":"#N/A"},{"$error":"#N/A"},{"$error":"#N/A"},{"$error":"#N/A"},{"$error":"#N/A"},{"$error":"#N/A"},{"$error":"#N/A"},{"$error":"#N/A"},{"$error":"#N/A"},{"$error":"#N/A"},{"$error":"#N/A"},{"$error":"#N/A"},{"$error":"#N/A"},{"$error":"#N/A"},{"$error":"#N/A"},{"$error":"#N/A"},{"$error":"#N/A"},{"$error":"#N/A"},{"$error":"#N/A"},{"$error":"#N/A"}]
{"$rows_left_out":336}
{"sheet":"OS Statistics","index":7,"n_rows":19,"n_cols":22,"rows_kept":19,"cut":false,"hidden":true,"merged":[[3,1,3,2],[3,3,3,4],[3,5,3,6],[3,7,3,8],[3,9,3,10],[2,1,2,2],[2,3,2,4],[2,5,2,6],[2,7,2,8],[2,9,2,10],[3,11,3,12],[3,13,3,14],[3,15,3,16],[3,17,3,18],[3,19,3,20],[3,21,3,22],[2,13,2,14],[2,15,2,16],[2,17,2,18],[2,19,2,20],[2,21,2,22],[2,11,2,12],[5,1,5,2],[5,3,5,4],[5,5,5,6],[5,7,5,8],[5,9,5,10],[4,1,4,2],[4,3,4,4],[4,5,4,6],[4,7,4,8],[4,9,4,10],[5,11,5,12],[5,13,5,14],[5,15,5,16],[5,17,5,18],[5,19,5,20],[5,21,5,22],[4,13,4,14],[4,15,4,16],[4,17,4,18],[4,19,4,20],[4,21,4,22],[4,11,4,12],[7,1,7,2],[7,3,7,4],[7,5,7,6],[7,7,7,8],[7,9,7,10],[6,1,6,2],[6,3,6,4],[6,5,6,6],[6,7,6,8],[6,9,6,10],[7,11,7,12],[7,13,7,14],[7,15,7,16],[7,17,7,18],[7,19,7,20],[7,21,7,22],[6,13,6,14],[6,15,6,16],[6,17,6,18],[6,19,6,20],[6,21,6,22],[6,11,6,12],[9,1,9,2],[9,3,9,4],[9,5,9,6],[9,7,9,8],[9,9,9,10],[8,1,8,2],[8,3,8,4],[8,5,8,6],[8,7,8,8],[8,9,8,10],[9,11,9,12],[9,13,9,14],[9,15,9,16],[9,17,9,18],[9,19,9,20],[9,21,9,22],[8,13,8,14],[8,15,8,16],[8,17,8,18],[8,19,8,20],[8,21,8,22],[8,11,8,12],[11,1,11,2],[11,3,11,4],[11,5,11,6],[11,7,11,8],[11,9,11,10],[10,1,10,2],[10,3,10,4],[10,5,10,6],[10,7,10,8],[10,9,10,10],[11,11,11,12],[11,13,11,14],[11,15,11,16],[11,17,11,18],[11,19,11,20],[11,21,11,22],[10,13,10,14],[10,15,10,16],[10,17,10,18],[10,19,10,20],[10,21,10,22],[10,11,10,12],[13,1,13,2],[13,3,13,4],[13,5,13,6],[13,7,13,8],[13,9,13,10],[12,1,12,2],[12,3,12,4],[12,5,12,6],[12,7,12,8],[12,9,12,10],[13,11,13,12],[13,13,13,14],[13,15,13,16],[13,17,13,18],[13,19,13,20],[13,21,13,22],[12,13,12,14],[12,15,12,16],[12,17,12,18],[12,19,12,20],[12,21,12,22],[12,11,12,12],[15,1,15,2],[15,3,15,4],[15,5,15,6],[15,7,15,8],[15,9,15,10],[14,1,14,2],[14,3,14,4],[14,5,14,6],[14,7,14,8],[14,9,14,10],[16,11,16,12],[15,11,15,12],[15,13,15,14],[15,15,15,16],[15,17,15,18],[15,19,15,20],[15,21,15,22],[14,13,14,14],[14,15,14,16],[14,17,14,18],[14,19,14,20],[14,21,14,22],[14,11,14,12],[17,3,17,4],[17,5,17,6],[17,7,17,8],[17,9,17,10],[16,1,16,2],[16,3,16,4],[16,5,16,6],[16,7,16,8],[16,9,16,10],[1,1,1,4],[18,13,18,14],[18,15,18,16],[18,17,18,18],[18,19,18,20],[18,21,18,22],[18,1,18,2],[18,3,18,4],[18,5,18,6],[18,7,18,8],[18,9,18,10],[18,11,18,12],[17,11,17,12],[17,13,17,14],[17,15,17,16],[17,17,17,18],[17,19,17,20],[17,21,17,22],[16,13,16,14],[16,15,16,16],[16,17,16,18],[16,19,16,20],[16,21,16,22],[17,1,17,2]]}
[]
[null,"Optimized Schedule Statistics"]
[null,"Resident Name",null,"Number of Shifts",null,"Number of Shifts Under the Minimum",null,"Number of Shifts Exceeding the Maximum",null,"Number of Night Shifts",null,"Number of Night Shifts Under the Minimum",null,"Number of Night Shifts Exceeding Maximum",null,"Number of 7a-4p Shifts (Applies to Interns Only)",null,"Number of 11p-8a Shifts (Applies to Interns Only)",null,"Number of Shifts on Required Day Off",null,"Required Day Off"]
[null,{"$f":"'Build Your Schedule'!B6","v":"Adamson"},null,{"$f":"COUNTIF('Optimization Approach'!$C$5:$AF$11,B4)","v":0},null,{"$f":"IF($D4<12,12-D4,0)","v":12},null,{"$f":"IF($D4>16,D4-16,0)","v":0},null,{"$f":"COUNTIF('Optimization Approach'!$C$10:$AF$11,'OS Statistics'!B4)","v":0},null,{"$f":"IF(J4<2,2-J4,0)","v":2},null,{"$f":"IF(J4>5,J4-5,0)","v":0},null,{"$f":"COUNTIF('Optimization Approach'!$C$5:$AF$5,B4)","v":0},null,{"$f":"COUNTIF('Optimization Approach'!$C$11:$AF$11,B4)","v":0},null,{"$f":"COUNTIF('Optimization Approach'!$E$5:$E$11,B4)+COUNTIF('Optimization Approach'!$L$5:$L$11,B4)+COUNTIF('Optimization Approach'!$S$5:$S$11,B4)+COUNTIF('Optimization Approach'!$Z$5:$Z$11,B4)","v":0},null,{"$f":"'Build Your Schedule'!E6","v":"Wednesdays"}]
[null,{"$f":"'Build Your Schedule'!B7","v":"Almanza"},null,{"$f":"COUNTIF('Optimization Approach'!$C$5:$AF$11,B5)","v":0},null,{"$f":"IF($D5<12,12-D5,0)","v":12},null,{"$f":"IF($D5>16,D5-16,0)","v":0},null,{"$f":"COUNTIF('Optimization Approach'!$C$10:$AF$11,'OS Statistics'!B5)","v":0},null,{"$f":"IF(J5<2,2-J5,0)","v":2},null,{"$f":"IF(J5>5,J5-5,0)","v":0},null,"N/A",null,"N/A",null,{"$f":"COUNTIF('Optimization Approach'!$F$5:$F$11,B5)+COUNTIF('Optimization Approach'!$M$5:$M$11,B5)+COUNTIF('Optimization Approach'!$T$5:$T$11,B5)+COUNTIF('Optimization Approach'!$AA$5:$AA$11,B5)","v":0},null,{"$f":"'Build Your Schedule'!E7","v":"Thursdays"}]
[null,{"$f":"'Build Your Schedule'!B8","v":"Chase"},null,{"$f":"COUNTIF('Optimization Approach'!$C$5:$AF$11,B6)","v":0},null,{"$f":"IF($D6<12,12-D6,0)","v":12},null,{"$f":"IF($D6>16,D6-16,0)","v":0},null,{"$f":"COUNTIF('Optimization Approach'!$C$10:$AF$11,'OS Statistics'!B6)","v":0},null,{"$f":"IF(J6<2,2-J6,0)","v":2},null,{"$f":"IF(J6>5,J6-5,0)","v":0},null,{"$f":"COUNTIF('Optimization Approach'!$C$5:$AF$5,B6)","v":0},null,{"$f":"COUNTIF('Optimization Approach'!$C$11:$AF$11,B6)","v":0},null,{"$f":"COUNTIF('Optimization Approach'!$C$5:$C$11,B6)+COUNTIF('Optimization Approach'!$J$5:$J$11,B6)+COUNTIF('Optimization Approach'!$Q$5:$Q$11,B6)+COUNTIF('Optimization Approach'!$X$5:$X$11,B6)+COUNTIF('Optimization Approach'!$AE$5:$AE$11,B6)","v":0},null,{"$f":"'Build Your Schedule'!E8","v":"Mondays"}]
[null,{"$f":"'Build Your Schedule'!B9","v":"Dunn"},null,{"$f":"COUNTIF('Optimization Approach'!$C$5:$AF$11,B7)","v":0},null,12,null,0,null,{"$f":"COUNTIF('Optimization Approach'!$C$10:$AF$11,'OS Statistics'!B7)","v":0},null,2,null,0,null,{"$f":"COUNTIF('Optimization Approach'!$C$5:$AF$5,B7)","v":0},null,{"$f":"COUNTIF('Optimization Approach'!$C$11:$AF$11,B7)","v":0},null,{"$f":"COUNTIF('Optimization Approach'!$E$5:$E$11,B7)+COUNTIF('Optimization Approach'!$L$5:$L$11,B7)+COUNTIF('Optimization Approach'!$S$5:$S$11,B7)+COUNTIF('Optimization Approach'!$Z$5:$Z$11,B7)","v":0},null,{"$f":"'Build Your Schedule'!E9","v":"Wednesdays"}]
[null,{"$f":"'Build Your Schedule'!B10","v":"Elder"},null,{"$f":"COUNTIF('Optimization Approach'!$C$5:$AF$11,B8)","v":0},null,12,null,0,null,{"$f":"COUNTIF('Optimization Approach'!$C$10:$AF$11,'OS Statistics'!B8)","v":0},null,2,null,0,null,"N/A",null,"N/A",null,{"$f":"COUNTIF('Optimization Approach'!$H$5:$H$11,B8)+COUNTIF('Optimization Approach'!$O$5:$O$11,B8)+COUNTIF('Optimization Approach'!$V$5:$V$11,B8)+COUNTIF('Optimization Approach'!$AC$5:$AC$11,B8)","v":0},null,{"$f":"'Build Your Schedule'!E10","v":"Saturdays"}]
{"$rows_left_out":12}
{"sheet":"checker","index":8,"n_rows":13,"n_cols":32,"rows_kept":13,"cut":false,"hidden":true,"merged":[[3,2,3,11]]}
[0," = number of checks"]
[]
[]
[null,null,"Your Original June Schedule"]
[null,null,"Mon","Tue","Wed","Thu","Fri","Sat","Sun","Mon","Tue","Wed","Thu","Fri","Sat","Sun","Mon","Tue","Wed","Thu","Fri","Sat","Sun","Mon","Tue","Wed","Thu","Fri","Sat","Sun","Mon","Tue"]
[null,null,"2015-06-01","2015-06-02","2015-06-03","2015-06-04","2015-06-05","2015-06-06","2015-06-07","2015-06-08","2015-06-09","2015-06-10","2015-06-11","2015-06-12","2015-06-13","2015-06-14","2015-06-15","2015-06-16","2015-06-17","2015-06-18","2015-06-19","2015-06-20","2015-06-21","2015-06-22","2015-06-23","2015-06-24","2015-06-25","2015-06-26","2015-06-27","2015-06-28","2015-06-29","2015-06-30"]
[null,"7a-4p"]
[null,"9a-6p"]
{"$rows_left_out":5}